Target
Extracellular calcium-sensing receptor
Ligand
BDBM50346036
Substrate
Meas. Tech.
ChEMBL_750426 (CHEMBL1785978)
IC50
320±n/a nM
Citation
 Balan, GBauman, JBhattacharya, SCastrodad, MHealy, DRHerr, MHumphries, PJennings, SKalgutkar, ASKapinos, BKhot, VLazarra, KLi, MLi, YNeagu, COliver, RPiotrowski, DWPrice, DQi, HSimmons, HASouthers, JWei, LZhang, YParalkar, VM The discovery of novel calcium sensing receptor negative allosteric modulators. Bioorg Med Chem Lett 19:3328-32 (2009)  
Target
Name:
Extracellular calcium-sensing receptor
Synonyms:
CASR_RAT Casr Parathyroid Cell calcium-sensing receptor | Pcar1
Type:
PROTEIN
Mol. Mass.:
120858.46
Organism:
Rattus norvegicus
Description:
ChEMBL_750426
Residue:
1079
  
Inhibitor
Name:
BDBM50346036
Synonyms:
CHEMBL1198855 | Ronacaleret
Type:
Small organic molecule
Emp. Form.:
C25H31F2NO4
Mol. Mass.:
447.5147
SMILES:
CC(C)(CC1Cc2ccccc2C1)NC[C@@H](O)COc1cc(CCC(O)=O)cc(F)c1F
: