Target
Cyclin-dependent kinase 6/G1/S-specific cyclin-D1
Ligand
BDBM50347388
Substrate
Meas. Tech.
ChEMBL_755647 (CHEMBL1805472)
IC50
35500±n/a nM
Citation
 Heathcote, DAPatel, HKroll, SHHazel, PPeriyasamy, MAlikian, MKanneganti, SKJogalekar, ASScheiper, BBarbazanges, MBlum, ABrackow, JSiwicka, APace, RDFuchter, MJSnyder, JPLiotta, DCFreemont, PSAboagye, EOCoombes, RCBarrett, AGAli, S A novel pyrazolo[1,5-a]pyrimidine is a potent inhibitor of cyclin-dependent protein kinases 1, 2, and 9, which demonstrates antitumor effects in human tumor xenografts following oral administration. J Med Chem 53:8508-22 (2010)  
Target
Name:
Cyclin-dependent kinase 6/G1/S-specific cyclin-D1
Synonyms:
CDK6/cyclin D1 | Cyclin-dependent kinase 6/G1/S-specific cyclin D1
Type:
Mol. Mass.:
Description:
ASSAY_ID of ChEMBL is 1935149
Components:
This complex has 2 components.
Component 1
Name:
G1/S-specific cyclin-D1
Synonyms:
B-cell lymphoma 1 protein BCL-1 oncogene CCND1 PRAD1 | PRAD1 oncogene
Type:
Enzyme Subunit
Mol. Mass.:
33717.70
Organism:
Homo sapiens (Human)
Description:
Residue:
295
  
Component 2
Name:
Cyclin-dependent kinase 6
Synonyms:
CDK6 CDKN6 Cyclin-dependent kinase 6 (CDK 6) | Serine/threonine-protein kinase PLSTIRE
Type:
Enzyme Subunit
Mol. Mass.:
36937.42
Organism:
Homo sapiens (Human)
Description:
Q00534
Residue:
326
  
Inhibitor
Name:
BDBM50347388
Synonyms:
CHEMBL1234833
Type:
Small organic molecule
Emp. Form.:
C20H27N5O3
Mol. Mass.:
385.4601
SMILES:
CC(C)c1cnn2c(NCc3ccccc3)cc(N[C@@H](CO)[C@H](O)CO)nc12
: