Target
P2Y purinoceptor 11
Ligand
BDBM2
Substrate
Meas. Tech.
ChEMBL_755242 (CHEMBL1806221)
EC50
3300±n/a nM
Citation
 Eliahu, SLecka, JReiser, GHaas, MBigonnesse, FLévesque, SAPelletier, JSévigny, JFischer, B Diadenosine 5',5''-(boranated)polyphosphonate analogues as selective nucleotide pyrophosphatase/phosphodiesterase inhibitors. J Med Chem 53:8485-97 (2010)  
Target
Name:
P2Y purinoceptor 11
Synonyms:
P2RY11 P2Y11 Purinergic receptor P2Y11
Type:
PROTEIN
Mol. Mass.:
40366.02
Organism:
Homo sapiens (Human)
Description:
ChEMBL_1362532
Residue:
374
  
Inhibitor
Name:
BDBM2
Synonyms:
({[({[(2R,3S,4R,5R)-5-(6-amino-9H-purin-9-yl)-3,4-dihydroxyoxolan-2-yl]methoxy}(hydroxy)phosphoryl)oxy](hydroxy)phosphoryl}oxy)phosphonic acid Brimonidine ATP | CHEMBL14249
Type:
Nucleoside or nucleotide
Emp. Form.:
C10H16N5O13P3
Mol. Mass.:
507.181
SMILES:
Nc1ncnc2n(cnc12)[C@@H]1O[C@H](COP(O)(=O)OP(O)(=O)OP(O)(O)=O)[C@@H](O)[C@H]1O
: