Target
Type 1 fimbrin D-mannose specific adhesin
Ligand
BDBM50347463
Substrate
Meas. Tech.
ChEMBL_755504 (CHEMBL1805065)
IC50
364±n/a nM
Citation
 Klein, TAbgottspon, DWittwer, MRabbani, SHerold, JJiang, XKleeb, SLüthi, CScharenberg, MBezençon, JGubler, EPang, LSmiesko, MCutting, BSchwardt, OErnst, B FimH antagonists for the oral treatment of urinary tract infections: from design and synthesis to in vitro and in vivo evaluation. J Med Chem 53:8627-41 (2010)  
Target
Name:
Type 1 fimbrin D-mannose specific adhesin
Synonyms:
Adhesin protein fimH fimH
Type:
PROTEIN
Mol. Mass.:
31474.61
Organism:
Escherichia coli (strain K12)
Description:
ChEMBL_1298296
Residue:
300
  
Inhibitor
Name:
BDBM50347463
Synonyms:
CHEMBL1170453
Type:
Small organic molecule
Emp. Form.:
C13H18O6
Mol. Mass.:
270.2784
SMILES:
OCC1OC(OCc2ccccc2)C(O)C(O)C1O
: