Target
Type 1 fimbiral adhesin FimH
Ligand
BDBM50347460
Substrate
Meas. Tech.
ChEMBL_755506 (CHEMBL1805067)
IC50
77140±n/a nM
Citation
 Klein, TAbgottspon, DWittwer, MRabbani, SHerold, JJiang, XKleeb, SLüthi, CScharenberg, MBezençon, JGubler, EPang, LSmiesko, MCutting, BSchwardt, OErnst, B FimH antagonists for the oral treatment of urinary tract infections: from design and synthesis to in vitro and in vivo evaluation. J Med Chem 53:8627-41 (2010)  
Target
Name:
Type 1 fimbiral adhesin FimH
Synonyms:
Type:
PROTEIN
Mol. Mass.:
31430.55
Organism:
Escherichia coli (strain UTI89 / UPEC)
Description:
ChEMBL_755506
Residue:
300
  
Inhibitor
Name:
BDBM50347460
Synonyms:
CHEMBL1170455
Type:
Small organic molecule
Emp. Form.:
C13H26O6
Mol. Mass.:
278.3419
SMILES:
CCCCCCCOC1OC(CO)C(O)C(O)C1O
: