Target
Heat shock protein HSP 90-alpha
Ligand
BDBM50347496
Substrate
Meas. Tech.
ChEMBL_754454 (CHEMBL1806079)
IC50
1140±n/a nM
Citation
 Bruncko, MTahir, SKSong, XChen, JDing, HHuth, JRJin, SJudge, RAMadar, DJPark, CHPark, CMPetros, AMTse, CRosenberg, SHElmore, SW N-aryl-benzimidazolones as novel small molecule HSP90 inhibitors. Bioorg Med Chem Lett 20:7503-6 (2010)  
Target
Name:
Heat shock protein HSP 90-alpha
Synonyms:
HS90A_HUMAN HSP86 HSP90AA1 HSPCA Heat shock 86 kDa Heat shock protein HSP 90-alpha (HSP90) LAP-2 Lipopolysaccharide-associated protein 2 heat shock protein 90kDa alpha (cytosolic), class A member 1 isoform 2
Type:
Molecular Chaperone
Mol. Mass.:
84623.45
Organism:
Homo sapiens (Human)
Description:
P07900
Residue:
732
  
Inhibitor
Name:
BDBM50347496
Synonyms:
CHEMBL1801579
Type:
Small organic molecule
Emp. Form.:
C24H18ClN3O5S
Mol. Mass.:
495.935
SMILES:
Oc1cc(O)c(cc1Cl)-n1c2ccc(CNS(=O)(=O)c3ccc4ccccc4c3)cc2[nH]c1=O
: