Target
Heat shock protein HSP 90-alpha
Ligand
BDBM50347498
Substrate
Meas. Tech.
ChEMBL_754454 (CHEMBL1806079)
IC50
127000±n/a nM
Citation
 Bruncko, MTahir, SKSong, XChen, JDing, HHuth, JRJin, SJudge, RAMadar, DJPark, CHPark, CMPetros, AMTse, CRosenberg, SHElmore, SW N-aryl-benzimidazolones as novel small molecule HSP90 inhibitors. Bioorg Med Chem Lett 20:7503-6 (2010)  
Target
Name:
Heat shock protein HSP 90-alpha
Synonyms:
HS90A_HUMAN HSP86 HSP90AA1 HSPCA Heat shock 86 kDa Heat shock protein HSP 90-alpha (HSP90) LAP-2 Lipopolysaccharide-associated protein 2 heat shock protein 90kDa alpha (cytosolic), class A member 1 isoform 2
Type:
Molecular Chaperone
Mol. Mass.:
84623.45
Organism:
Homo sapiens (Human)
Description:
P07900
Residue:
732
  
Inhibitor
Name:
BDBM50347498
Synonyms:
CHEMBL1802334 | hsp90_2
Type:
Small organic molecule
Emp. Form.:
C14H9F3N2O2
Mol. Mass.:
294.2287
SMILES:
Oc1ccc(cc1-n1c2ccccc2[nH]c1=O)C(F)(F)F
: