Target
Chitinase
Ligand
BDBM50347555
Substrate
Meas. Tech.
ChEMBL_756521 (CHEMBL1804594)
IC50
5500±n/a nM
Citation
 Garner, ALGloeckner, CTricoche, NZakhari, JSSamje, MCho-Ngwa, FLustigman, SJanda, KD Design, synthesis, and biological activities of closantel analogues: structural promiscuity and its impact on Onchocerca volvulus. J Med Chem 54:3963-72 (2011)  
Target
Name:
Chitinase
Synonyms:
Type:
PROTEIN
Mol. Mass.:
55694.80
Organism:
Onchocerca volvulus
Description:
ChEMBL_1369100
Residue:
497
  
Inhibitor
Name:
BDBM50347555
Synonyms:
3,5-Dibromo-2-hydroxy-N-(4-methoxyphenyl)benzamide (32) | CHEMBL1801802
Type:
Small organic molecule
Emp. Form.:
C14H11Br2NO3
Mol. Mass.:
401.05
SMILES:
COc1ccc(NC(=O)c2cc(Br)cc(Br)c2O)cc1
: