Target
Melatonin receptor type 1A
Ligand
BDBM50347590
Substrate
Meas. Tech.
ChEMBL_755971 (CHEMBL1803861)
Ki
0.026±n/a nM
Citation
 Koike, TTakai, THoashi, YNakayama, MKosugi, YNakashima, MYoshikubo, SHirai, KUchikawa, O Synthesis of a novel series of tricyclic dihydrofuran derivatives: discovery of 8,9-dihydrofuro[3,2-c]pyrazolo[1,5-a]pyridines as melatonin receptor (MT1/MT2) ligands. J Med Chem 54:4207-18 (2011)  
Target
Name:
Melatonin receptor type 1A
Synonyms:
MTNR1A MTR1A_HUMAN Mel1a melatonin receptor Melatonin receptor Melatonin receptor type 1 (MT1) | Melatonin receptor type 1A
Type:
Enzyme
Mol. Mass.:
39392.94
Organism:
Homo sapiens (Human)
Description:
P48039
Residue:
350
  
Inhibitor
Name:
BDBM50347590
Synonyms:
CHEMBL1802028
Type:
Small organic molecule
Emp. Form.:
C17H21N3O2
Mol. Mass.:
299.3675
SMILES:
CCC(=O)NCCc1c(nn2ccc3OCCc3c12)C1CC1
: