Target
Melatonin receptor type 1B
Ligand
BDBM50347590
Substrate
Meas. Tech.
ChEMBL_755972 (CHEMBL1803862)
Ki
0.14±n/a nM
Citation
 Koike, TTakai, THoashi, YNakayama, MKosugi, YNakashima, MYoshikubo, SHirai, KUchikawa, O Synthesis of a novel series of tricyclic dihydrofuran derivatives: discovery of 8,9-dihydrofuro[3,2-c]pyrazolo[1,5-a]pyridines as melatonin receptor (MT1/MT2) ligands. J Med Chem 54:4207-18 (2011)  
Target
Name:
Melatonin receptor type 1B
Synonyms:
MTNR1B Mel-1B-R Melatonin 1B Melatonin receptor type 1B | Melatonin receptor type 2 (MT2)
Type:
Enzyme
Mol. Mass.:
40203.54
Organism:
Homo sapiens (Human)
Description:
P49286
Residue:
362
  
Inhibitor
Name:
BDBM50347590
Synonyms:
CHEMBL1802028
Type:
Small organic molecule
Emp. Form.:
C17H21N3O2
Mol. Mass.:
299.3675
SMILES:
CCC(=O)NCCc1c(nn2ccc3OCCc3c12)C1CC1
: