Target
Sonic hedgehog protein
Ligand
BDBM50347600
Substrate
Meas. Tech.
ChEMBL_756358 (CHEMBL1805384)
IC50
3200±n/a nM
Citation
 Guerlet, GSpangenberg, TMann, AFaure, HRuat, M Synthesis and biological evaluation of desmethylveramiline, a micromolar Hedgehog inhibitor. Bioorg Med Chem Lett 21:3608-12 (2011)  
Target
Name:
Sonic hedgehog protein
Synonyms:
Hhg1 Shh
Type:
Protein
Mol. Mass.:
47784.50
Organism:
Mus musculus (Mouse)
Description:
Q62226
Residue:
437
  
Inhibitor
Name:
BDBM50347600
Synonyms:
CHEMBL1803109
Type:
Small organic molecule
Emp. Form.:
C26H43NO
Mol. Mass.:
385.6257
SMILES:
C[C@@H]([C@H]1CC[C@H]2[C@@H]3CC=C4C[C@@H](O)CC[C@]4(C)[C@H]3CC[C@]12C)[C@@H]1CCCCN1
: