Target
Sonic hedgehog protein
Ligand
BDBM50232973
Substrate
Meas. Tech.
ChEMBL_756358 (CHEMBL1805384)
IC50
600±n/a nM
Citation
 Guerlet, GSpangenberg, TMann, AFaure, HRuat, M Synthesis and biological evaluation of desmethylveramiline, a micromolar Hedgehog inhibitor. Bioorg Med Chem Lett 21:3608-12 (2011)  
Target
Name:
Sonic hedgehog protein
Synonyms:
Hhg1 Shh
Type:
Protein
Mol. Mass.:
47784.50
Organism:
Mus musculus (Mouse)
Description:
Q62226
Residue:
437
  
Inhibitor
Name:
BDBM50232973
Synonyms:
CHEMBL254129 | CYCLOPAMINE
Type:
Small organic molecule
Emp. Form.:
C27H41NO2
Mol. Mass.:
411.6199
SMILES:
C[C@@H]1[C@@H]2NC[C@@H](C)C[C@H]2O[C@]11CC[C@H]2[C@@H]3CC=C4C[C@@H](O)CC[C@]4(C)[C@H]3CC2=C1C
: