Target
Potassium voltage-gated channel subfamily H member 2
Ligand
BDBM50347940
Substrate
Meas. Tech.
ChEMBL_755804 (CHEMBL1803471)
IC50
>30000±n/a nM
Citation
 Wu, TNagle, AKuhen, KGagaring, KBorboa, RFrancek, CChen, ZPlouffe, DGoh, ALakshminarayana, SBWu, JAng, HQZeng, PKang, MLTan, WTan, MYe, NLin, XCaldwell, CEk, JSkolnik, SLiu, FWang, JChang, JLi, CHollenbeck, TTuntland, TIsbell, JFischli, CBrun, RRottmann, MDartois, VKeller, TDiagana, TWinzeler, EGlynne, RTully, DCChatterjee, AK Imidazolopiperazines: hit to lead optimization of new antimalarial agents. J Med Chem 54:5116-30 (2011)  
Target
Name:
Potassium voltage-gated channel subfamily H member 2
Synonyms:
1,3-beta-glucan synthase component GLS2 ERG Eag-related protein 1 Ether-a-go-go-related gene (HERG) Ether-a-go-go-related gene potassium channel 1 Ether-a-go-go-related gene potassium channel 1 (hERG1) Ether-a-go-go-related protein 1 H-ERG KCNH2 Potassium voltage-gated channel subfamily H member 2 (hERG) Voltage-gated potassium channel subunit Kv11.1 hERG Potassium Channel 1 | putative potassium channel subunit
Type:
Multi-pass membrane protein
Mol. Mass.:
126672.65
Organism:
Homo sapiens (Human)
Description:
Q12809
Residue:
1159
  
Inhibitor
Name:
BDBM50347940
Synonyms:
CHEMBL1800831
Type:
Small organic molecule
Emp. Form.:
C20H19F2N5O
Mol. Mass.:
383.3946
SMILES:
NCC(=O)N1CCn2c(C1)nc(c2Nc1ccc(F)cc1)-c1cccc(F)c1
: