Target
Prostaglandin E2 receptor EP2 subtype
Ligand
BDBM50350349
Substrate
Meas. Tech.
ChEMBL_761105 (CHEMBL1815359)
Ki
210±n/a nM
Citation
 Iwahashi, MShimabukuro, AOnoda, TMatsunaga, YOkada, YMatsumoto, RNambu, FNakai, HToda, M Discovery of selective indole-based prostaglandin D2 receptor antagonist. Bioorg Med Chem 19:4574-88 (2011)  
Target
Name:
Prostaglandin E2 receptor EP2 subtype
Synonyms:
PE2R2_MOUSE Prostaglandin E2 Prostanoid EP2 receptor Ptgerep2
Type:
G-protein coupled receptor
Mol. Mass.:
40495.26
Organism:
Mus musculus (Mouse)
Description:
Residue:
362
  
Inhibitor
Name:
BDBM50350349
Synonyms:
CHEMBL1813115
Type:
Small organic molecule
Emp. Form.:
C28H26N2O5
Mol. Mass.:
470.5164
SMILES:
CN1C[C@@H](COc2ccc(cc2)C(=O)n2c(C)c(CC(O)=O)c3ccccc23)Oc2ccccc12
: