Target
Thromboxane A2 receptor
Ligand
BDBM50350367
Substrate
Meas. Tech.
ChEMBL_761109 (CHEMBL1815363)
Ki
>10000±n/a nM
Citation
 Iwahashi, MShimabukuro, AOnoda, TMatsunaga, YOkada, YMatsumoto, RNambu, FNakai, HToda, M Discovery of selective indole-based prostaglandin D2 receptor antagonist. Bioorg Med Chem 19:4574-88 (2011)  
Target
Name:
Thromboxane A2 receptor
Synonyms:
Prostanoid TP receptor TBXA2R Thromboxane Thromboxane Beta
Type:
Enyzme
Mol. Mass.:
37445.28
Organism:
Homo sapiens (Human)
Description:
P21731
Residue:
343
  
Inhibitor
Name:
BDBM50350367
Synonyms:
CHEMBL1813116
Type:
Small organic molecule
Emp. Form.:
C29H28N2O5
Mol. Mass.:
484.543
SMILES:
CN1C[C@@H](COc2ccc(cc2)C(=O)n2c(C)c(CC(O)=O)c3cc(C)ccc23)Oc2ccccc12
: