Target
Cannabinoid receptor 1
Ligand
BDBM50200841
Substrate
Meas. Tech.
ChEMBL_762512 (CHEMBL1816969)
pH
7.4±n/a
IC50
0.3±n/a nM
Comments
extracted
Citation
 Sasmal, PKTalwar, RSwetha, JBalasubrahmanyam, DVenkatesham, BRawoof, KANeelima Devi, BJadhav, VPKhan, SKMohan, PSrinivasa Reddy, DNyavanandi, VKNanduri, SShiva Kumar, KKannan, MSrinivas, PNadipalli, PChaudhury, HSebastian, VJ Structure-activity relationship studies of novel pyrazole and imidazole carboxamides as cannabinoid-1 (CB1) antagonists. Bioorg Med Chem Lett 21:4913-8 (2011)  
Target
Name:
Cannabinoid receptor 1
Synonyms:
Brain-type cannabinoid receptor CB-R CNR1_RAT Cannabinoid receptor Cnr1 | Skr6
Type:
G Protein-Coupled Receptor (GPCR)
Mol. Mass.:
52856.55
Organism:
Rattus norvegicus (rat)
Description:
P20272
Residue:
473
  
Inhibitor
Name:
BDBM50200841
Synonyms:
CHEMBL220360 MK-0634 N-[(1S,2S)-3-(4-chlorophenyl)-2-(3-cyanophenyl)-1-methylpropyl]-2-methyl-2-{[5-(trifluoromethyl)pyridin-2-yl]oxy}propanamide Taranbant
Type:
Small organic molecule
Emp. Form.:
C27H25ClF3N3O2
Mol. Mass.:
515.955
SMILES:
C[C@H](NC(=O)C(C)(C)Oc1ccc(cn1)C(F)(F)F)[C@@H](Cc1ccc(Cl)cc1)c1cccc(c1)C#N
: