Target
Cannabinoid receptor 1
Ligand
BDBM50350447
Substrate
Meas. Tech.
ChEMBL_762512 (CHEMBL1816969)
pH
7.4±n/a
IC50
0.1±n/a nM
Comments
extracted
Citation
 Sasmal, PKTalwar, RSwetha, JBalasubrahmanyam, DVenkatesham, BRawoof, KANeelima Devi, BJadhav, VPKhan, SKMohan, PSrinivasa Reddy, DNyavanandi, VKNanduri, SShiva Kumar, KKannan, MSrinivas, PNadipalli, PChaudhury, HSebastian, VJ Structure-activity relationship studies of novel pyrazole and imidazole carboxamides as cannabinoid-1 (CB1) antagonists. Bioorg Med Chem Lett 21:4913-8 (2011)  
Target
Name:
Cannabinoid receptor 1
Synonyms:
Brain-type cannabinoid receptor CB-R CNR1_RAT Cannabinoid receptor Cnr1 | Skr6
Type:
G Protein-Coupled Receptor (GPCR)
Mol. Mass.:
52856.55
Organism:
Rattus norvegicus (rat)
Description:
P20272
Residue:
473
  
Inhibitor
Name:
BDBM50350447
Synonyms:
CHEMBL1814329
Type:
Small organic molecule
Emp. Form.:
C23H15Cl3F3N5O2
Mol. Mass.:
556.752
SMILES:
Cc1c(nn(c1-c1ccc(Cl)cc1)-c1ccc(Cl)cc1Cl)C(=O)NC1(CC1)c1noc(n1)C(F)(F)F
: