Target
Fatty-acid amide hydrolase 1
Ligand
BDBM50350535
Substrate
Meas. Tech.
ChEMBL_762794 (CHEMBL1816096)
IC50
0.093±n/a nM
Citation
 Otrubova, KEzzili, CBoger, DL The discovery and development of inhibitors of fatty acid amide hydrolase (FAAH). Bioorg Med Chem Lett 21:4674-85 (2011)  
Target
Name:
Fatty-acid amide hydrolase 1
Synonyms:
Anandamide amidohydrolase FAAH FAAH1_HUMAN Fatty-acid amide hydrolase (FAAH) Oleamide hydrolase 1
Type:
Protein
Mol. Mass.:
63071.19
Organism:
Homo sapiens (Human)
Description:
O00519
Residue:
579
  
Inhibitor
Name:
BDBM50350535
Synonyms:
CHEMBL1812722
Type:
Small organic molecule
Emp. Form.:
C22H22FN3O3
Mol. Mass.:
395.4268
SMILES:
Fc1cccc(COc2ccc(OC3CCN(CC3)C(=O)n3ccnc3)cc2)c1
: