Target
Corticotropin-releasing factor receptor 1
Ligand
BDBM50351397
Substrate
Meas. Tech.
ChEMBL_764455 (CHEMBL1821007)
IC50
22±n/a nM
Citation
 Saito, TObitsu, TKondo, TMatsui, TNagao, YKusumi, KMatsumura, NUeno, SKishi, AKatsumata, SKagamiishi, YNakai, HToda, M 6,7-Dihydro-5H-cyclopenta[d]pyrazolo[1,5-a]pyrimidines and their derivatives as novel corticotropin-releasing factor 1 receptor antagonists. Bioorg Med Chem 19:5432-45 (2011)  
Target
Name:
Corticotropin-releasing factor receptor 1
Synonyms:
CRF-R CRF1 CRFR1 CRH-R 1 CRHR1 Corticotropin-releasing factor receptor 1 (CRF-1) Corticotropin-releasing hormone receptor 1
Type:
Enzyme
Mol. Mass.:
50744.31
Organism:
Homo sapiens (Human)
Description:
P34998
Residue:
444
  
Inhibitor
Name:
BDBM50351397
Synonyms:
CHEMBL1819087
Type:
Small organic molecule
Emp. Form.:
C21H25ClN4O2
Mol. Mass.:
400.902
SMILES:
CCC(CC)Nc1c2COCc2nc2c(c(C)nn12)-c1ccc(OC)cc1Cl
: