Target
Prostacyclin receptor
Ligand
BDBM50351481
Substrate
Meas. Tech.
ChEMBL_764674 (CHEMBL1821226)
Ki
2600±n/a nM
Citation
 Iwahashi, MTakahashi, ETanaka, MMatsunaga, YOkada, YMatsumoto, RNambu, FNakai, HToda, M Design and synthesis of new prostaglandin D2 receptor antagonists. Bioorg Med Chem 19:5361-71 (2011)  
Target
Name:
Prostacyclin receptor
Synonyms:
PGI receptor PRIPR Prostacyclin (IP) Receptor Prostaglandin I Prostaglandin I2 receptor | Prostanoid IP receptor
Type:
G Protein-Coupled Receptor (GPCR)
Mol. Mass.:
40968.22
Organism:
Homo sapiens (Human)
Description:
The membranes prepared from human platelet were used in binding assay.
Residue:
386
  
Inhibitor
Name:
BDBM50351481
Synonyms:
CHEMBL1819611
Type:
Small organic molecule
Emp. Form.:
C27H28N2O5
Mol. Mass.:
460.5216
SMILES:
CN1C[C@@H](COc2ccc(C(=O)Nc3cc(CC(O)=O)ccc3C)c(C)c2)Oc2ccccc12
: