Target
Aromatase
Ligand
BDBM13061
Substrate
Meas. Tech.
ChEMBL_765426 (CHEMBL1828368)
IC50
8±n/a nM
Citation
 Doiron, JSoultan, AHRichard, RTouré, MMPicot, NRichard, RCuperlovic-Culf, MRobichaud, GATouaibia, M Synthesis and structure-activity relationship of 1- and 2-substituted-1,2,3-triazole letrozole-based analogues as aromatase inhibitors. Eur J Med Chem 46:4010-24 (2011)  
Target
Name:
Aromatase
Synonyms:
ARO1 CP19A_HUMAN CYP19 CYPXIX Cytochrome P450 19A1 Cytochrome P450-C19 (CYP19) FL cytokine receptor precursor | P-450AROM
Type:
Enzyme
Mol. Mass.:
57888.92
Organism:
Homo sapiens (Human)
Description:
P11511
Residue:
503
  
Inhibitor
Name:
BDBM13061
Synonyms:
4,4 -(1H-1,2,4-triazol-1-ylmethanediyl)dibenzonitrile CHEMBL1444 | Letrozole
Type:
Small organic molecule
Emp. Form.:
C17H11N5
Mol. Mass.:
285.3027
SMILES:
N#Cc1ccc(cc1)C(c1ccc(cc1)C#N)n1cncn1
: