Target
CDGSH iron-sulfur domain-containing protein 1
Ligand
BDBM50322615
Substrate
Meas. Tech.
ChEMBL_766432 (CHEMBL1826572)
IC50
3360±n/a nM
Citation
 Geldenhuys, WJFunk, MOAwale, PSLin, LCarroll, RT A novel binding assay identifies high affinity ligands to the rosiglitazone binding site of mitoNEET. Bioorg Med Chem Lett 21:5498-501 (2011)  
Target
Name:
CDGSH iron-sulfur domain-containing protein 1
Synonyms:
C10orf70 CISD1_HUMAN ZCD1
Type:
PROTEIN
Mol. Mass.:
12206.48
Organism:
Homo sapiens (Human)
Description:
ChEMBL_766432
Residue:
108
  
Inhibitor
Name:
BDBM50322615
Synonyms:
CHEMBL1173685 Resveratrol Potassium3-Sulfate
Type:
Small organic molecule
Emp. Form.:
C14H11O6S
Mol. Mass.:
307.299
SMILES:
Oc1ccc(\C=C\c2cc(O)cc(OS([O-])(=O)=O)c2)cc1
: