Target
CDGSH iron-sulfur domain-containing protein 1
Ligand
BDBM50350499
Substrate
Meas. Tech.
ChEMBL_766432 (CHEMBL1826572)
IC50
13340±n/a nM
Citation
 Geldenhuys, WJFunk, MOAwale, PSLin, LCarroll, RT A novel binding assay identifies high affinity ligands to the rosiglitazone binding site of mitoNEET. Bioorg Med Chem Lett 21:5498-501 (2011)  
Target
Name:
CDGSH iron-sulfur domain-containing protein 1
Synonyms:
C10orf70 CISD1_HUMAN ZCD1
Type:
PROTEIN
Mol. Mass.:
12206.48
Organism:
Homo sapiens (Human)
Description:
ChEMBL_766432
Residue:
108
  
Inhibitor
Name:
BDBM50350499
Synonyms:
CHEMBL1814636
Type:
Small organic molecule
Emp. Form.:
C12H13NO2S
Mol. Mass.:
235.302
SMILES:
Cc1cc(C)cc(Cc2sc(=O)[nH]c2O)c1
: