Target
Carbonic anhydrase 6
Ligand
BDBM50352646
Substrate
Meas. Tech.
ChEMBL_766484 (CHEMBL1826749)
pH
7.5±n/a
Ki
814±n/a nM
Comments
extracted
Citation
 Rami, MInnocenti, AMontero, JLScozzafava, AWinum, JYSupuran, CT Synthesis of rhodamine B-benzenesulfonamide conjugates and their inhibitory activity against humana- and bacterial/fungalß-carbonic anhydrases. Bioorg Med Chem Lett 21:5210-3 (2011)  
Target
Name:
Carbonic anhydrase 6
Synonyms:
CA-VI CAH6_HUMAN Carbonic Anhydrase VI Carbonic anhydrase 6 Carbonic anhydrase 6 (CA-VI) Salivary carbonic anhydrase | Secreted carbonic anhydrase
Type:
Enzyme
Mol. Mass.:
35371.40
Organism:
Homo sapiens (Human)
Description:
P23280
Residue:
308
  
Inhibitor
Name:
BDBM50352646
Synonyms:
CHEMBL1822702
Type:
Small organic molecule
Emp. Form.:
C36H40N4O4S
Mol. Mass.:
624.792
SMILES:
CCN(CC)c1ccc2c(Oc3cc(ccc3C22N(CCc3ccc(cc3)S(N)(=O)=O)C(=O)c3ccccc23)N(CC)CC)c1
: