Target
Carbonic anhydrase 9
Ligand
BDBM50352646
Substrate
Meas. Tech.
ChEMBL_766486 (CHEMBL1826751)
pH
7.5±n/a
Ki
19.4±n/a nM
Comments
extracted
Citation
 Rami, MInnocenti, AMontero, JLScozzafava, AWinum, JYSupuran, CT Synthesis of rhodamine B-benzenesulfonamide conjugates and their inhibitory activity against humana- and bacterial/fungalß-carbonic anhydrases. Bioorg Med Chem Lett 21:5210-3 (2011)  
Target
Name:
Carbonic anhydrase 9
Synonyms:
CA-IX CAH9_HUMAN Carbonic anhydrase 9 (CA IX) Carbonic anhydrase 9 precursor Carbonic anhydrase IX (CAIX) Carbonic anhydrases; II & IX MN RCC-associated antigen G250
Type:
Enzyme
Mol. Mass.:
49669.03
Organism:
Homo sapiens (Human)
Description:
Catalytic domain of human cloned isozyme was used in the assay
Residue:
459
  
Inhibitor
Name:
BDBM50352646
Synonyms:
CHEMBL1822702
Type:
Small organic molecule
Emp. Form.:
C36H40N4O4S
Mol. Mass.:
624.792
SMILES:
CCN(CC)c1ccc2c(Oc3cc(ccc3C22N(CCc3ccc(cc3)S(N)(=O)=O)C(=O)c3ccccc23)N(CC)CC)c1
: