Target
Carbonic anhydrase 13
Ligand
BDBM50352646
Substrate
Meas. Tech.
ChEMBL_766491 (CHEMBL1826756)
pH
7.5±n/a
Ki
463±n/a nM
Comments
extracted
Citation
 Rami, MInnocenti, AMontero, JLScozzafava, AWinum, JYSupuran, CT Synthesis of rhodamine B-benzenesulfonamide conjugates and their inhibitory activity against humana- and bacterial/fungalß-carbonic anhydrases. Bioorg Med Chem Lett 21:5210-3 (2011)  
Target
Name:
Carbonic anhydrase 13
Synonyms:
CA13 Carbonic anhydrase Carbonic anhydrase XIII (CA XIII)
Type:
Enzyme
Mol. Mass.:
29445.78
Organism:
Homo sapiens (Human)
Description:
Q8N1Q1
Residue:
262
  
Inhibitor
Name:
BDBM50352646
Synonyms:
CHEMBL1822702
Type:
Small organic molecule
Emp. Form.:
C36H40N4O4S
Mol. Mass.:
624.792
SMILES:
CCN(CC)c1ccc2c(Oc3cc(ccc3C22N(CCc3ccc(cc3)S(N)(=O)=O)C(=O)c3ccccc23)N(CC)CC)c1
: