Target
5-hydroxytryptamine receptor 7
Ligand
BDBM50352724
Substrate
Meas. Tech.
ChEMBL_766798 (CHEMBL1827738)
IC50
11±n/a nM
Citation
 Seo, HJPark, EJKim, MJKang, SYLee, SHKim, HJLee, KNJung, MELee, MKim, MSSon, EJPark, WKKim, JLee, J Design and synthesis of novel arylpiperazine derivatives containing the imidazole core targeting 5-HT(2A) receptor and 5-HT transporter. J Med Chem 54:6305-18 (2011)  
Target
Name:
5-hydroxytryptamine receptor 7
Synonyms:
5-HT-7 5-HT7 5-HT7S 5HT7 HTR7 | Serotonin receptor 7
Type:
G Protein-Coupled Receptor (GPCR)
Mol. Mass.:
53573.08
Organism:
Homo sapiens (Human)
Description:
P34969
Residue:
479
  
Inhibitor
Name:
BDBM50352724
Synonyms:
CHEMBL1822896 | US8835436, Example 6
Type:
Small organic molecule
Emp. Form.:
C25H29Cl2N5O
Mol. Mass.:
486.437
SMILES:
Cc1nc(C(=O)NCCCN2CCN(CC2)c2cccc(Cl)c2Cl)c(C)n1-c1ccccc1
: