Target
Cannabinoid receptor 2
Ligand
BDBM50353089
Substrate
Meas. Tech.
ChEMBL_767975 (CHEMBL1825304)
Ki
0.014±n/a nM
Citation
 Turkman, NShavrin, AIvanov, RARabinovich, BVolgin, AGelovani, JGAlauddin, MM Fluorinated cannabinoid CB2 receptor ligands: synthesis and in vitro binding characteristics of 2-oxoquinoline derivatives. Bioorg Med Chem 19:5698-707 (2011)  
Target
Name:
Cannabinoid receptor 2
Synonyms:
CANNABINOID CB2 CB2 CB2B CNR2_HUMAN Cannabinoid CB2 receptor Cannabinoid receptor 2 (CB2R) | hCB2
Type:
G Protein-Coupled Receptor (GPCR)
Mol. Mass.:
39690.94
Organism:
Homo sapiens (Human)
Description:
P34972
Residue:
360
  
Inhibitor
Name:
BDBM50353089
Synonyms:
CHEMBL1822939
Type:
Small organic molecule
Emp. Form.:
C17H21NO5
Mol. Mass.:
319.3523
SMILES:
CCCCCc1cc2cc(C(=O)OC)c(=O)[nH]c2c(O)c1OC
: