Target
Cannabinoid receptor 2
Ligand
BDBM50353086
Substrate
Meas. Tech.
ChEMBL_767975 (CHEMBL1825304)
Ki
0.021±n/a nM
Citation
 Turkman, NShavrin, AIvanov, RARabinovich, BVolgin, AGelovani, JGAlauddin, MM Fluorinated cannabinoid CB2 receptor ligands: synthesis and in vitro binding characteristics of 2-oxoquinoline derivatives. Bioorg Med Chem 19:5698-707 (2011)  
Target
Name:
Cannabinoid receptor 2
Synonyms:
CANNABINOID CB2 CB2 CB2B CNR2_HUMAN Cannabinoid CB2 receptor Cannabinoid receptor 2 (CB2R) | hCB2
Type:
G Protein-Coupled Receptor (GPCR)
Mol. Mass.:
39690.94
Organism:
Homo sapiens (Human)
Description:
P34972
Residue:
360
  
Inhibitor
Name:
BDBM50353086
Synonyms:
CHEMBL1822940
Type:
Small organic molecule
Emp. Form.:
C22H23FN2O4
Mol. Mass.:
398.4274
SMILES:
CCCOc1c(OC)ccc2cc(C(=O)NCCc3ccc(F)cc3)c(=O)[nH]c12
: