Target
Cystic fibrosis transmembrane conductance regulator
Ligand
BDBM50353345
Substrate
Meas. Tech.
ChEMBL_769085 (CHEMBL1832642)
IC50
25±n/a nM
Citation
 Snyder, DSTradtrantip, LYao, CKurth, MJVerkman, AS Potent, metabolically stable benzopyrimido-pyrrolo-oxazine-dione (BPO) CFTR inhibitors for polycystic kidney disease. J Med Chem 54:5468-77 (2011)  
Target
Name:
Cystic fibrosis transmembrane conductance regulator
Synonyms:
ABCC7 CFTR Channel conductance-controlling ATPase | cAMP-dependent chloride channel
Type:
Enzyme Catalytic Domain
Mol. Mass.:
168171.30
Organism:
Homo sapiens (Human)
Description:
gi_90421313
Residue:
1480
  
Inhibitor
Name:
BDBM50353345
Synonyms:
CHEMBL1831069
Type:
Small organic molecule
Emp. Form.:
C25H17BrN4O6
Mol. Mass.:
549.33
SMILES:
Cn1c2c3C(Oc4ccc(cc4-n3c(-c3ccccc3)c2c(=O)n(C)c1=O)[N+]([O-])=O)c1ccc(Br)o1
: