Target
Corticotropin-releasing factor receptor 1
Ligand
BDBM50354015
Substrate
Meas. Tech.
ChEMBL_770316 (CHEMBL1833625)
IC50
4.4±n/a nM
Citation
 Saito, TObitsu, TMinamoto, CSugiura, TMatsumura, NUeno, SKishi, AKatsumata, SNakai, HToda, M Pyrazolo[1,5-a]pyrimidines, triazolo[1,5-a]pyrimidines and their tricyclic derivatives as corticotropin-releasing factor 1 (CRF¿?) receptor antagonists. Bioorg Med Chem 19:5955-66 (2011)  
Target
Name:
Corticotropin-releasing factor receptor 1
Synonyms:
CRF-R CRF1 CRFR1 CRH-R 1 CRHR1 Corticotropin-releasing factor receptor 1 (CRF-1) Corticotropin-releasing hormone receptor 1
Type:
Enzyme
Mol. Mass.:
50744.31
Organism:
Homo sapiens (Human)
Description:
P34998
Residue:
444
  
Inhibitor
Name:
BDBM50354015
Synonyms:
CHEMBL1828900
Type:
Small organic molecule
Emp. Form.:
C22H28ClN5O
Mol. Mass.:
413.944
SMILES:
CCCN(CCC)c1cc(nc2ccnn12)N(CC=C)c1ccc(OC)cc1Cl
: