Target
Delta-type opioid receptor
Ligand
BDBM50354575
Substrate
Meas. Tech.
ChEMBL_771899 (CHEMBL1839053)
Ki
6.8±n/a nM
Citation
 Cami-Kobeci, GPolgar, WEKhroyan, TVToll, LHusbands, SM Structural determinants of opioid and NOP receptor activity in derivatives of buprenorphine. J Med Chem 54:6531-7 (2011)  
Target
Name:
Delta-type opioid receptor
Synonyms:
D-OR-1 Delta opioid receptor OPIATE Delta OPRD1 OPRK1 | opioid receptor, delta 1
Type:
G Protein-Coupled Receptor (GPCR)
Mol. Mass.:
40382.98
Organism:
Homo sapiens (Human)
Description:
Competition binding assays were carried out using membrane preparations from transfected HN9.10 cells that constitutively expressed the delta opioid receptor.
Residue:
372
  
Inhibitor
Name:
BDBM50354575
Synonyms:
CHEMBL1834414
Type:
Small organic molecule
Emp. Form.:
C29H40BrNO4
Mol. Mass.:
546.536
SMILES:
CO[C@]12CC[C@@]3(C[C@@H]1[C@@](C)(O)C(C)(C)C)[C@H]1Cc4c5c(O[C@@H]2[C@@]35CCN1CC1CC1)c(O)cc4Br
: