Target
Mu-type opioid receptor
Ligand
BDBM50354570
Substrate
Meas. Tech.
ChEMBL_771898 (CHEMBL1838909)
Ki
2.1±n/a nM
Citation
 Cami-Kobeci, GPolgar, WEKhroyan, TVToll, LHusbands, SM Structural determinants of opioid and NOP receptor activity in derivatives of buprenorphine. J Med Chem 54:6531-7 (2011)  
Target
Name:
Mu-type opioid receptor
Synonyms:
M-OR-1 MOR-1 MUOR1 Mu opiate receptor OPRM1 hMOP | mu-type opioid receptor isoform MOR-1
Type:
G Protein-Coupled Receptor (GPCR)
Mol. Mass.:
44789.51
Organism:
Homo sapiens (Human)
Description:
P35372
Residue:
400
  
Inhibitor
Name:
BDBM50354570
Synonyms:
CHEMBL1834409
Type:
Small organic molecule
Emp. Form.:
C30H43NO4
Mol. Mass.:
481.6667
SMILES:
CCC(C)(C)[C@](C)(O)[C@H]1C[C@]23CC[C@]1(OC)[C@@H]1Oc4c5c(C[C@H]2N(CC2CC2)CC[C@@]315)ccc4O
: