Target
B1 bradykinin receptor
Ligand
BDBM50355072
Substrate
Meas. Tech.
ChEMBL_772684 (CHEMBL1837152)
Ki
159±n/a nM
Citation
 Biswas, KPeterkin, TABryan, MCArik, LLehto, SGSun, HHsieh, FYXu, CFremeau, RTAllen, JR Discovery of potent, orally bioavailable phthalazinone bradykinin B1 receptor antagonists. J Med Chem 54:7232-46 (2011)  
Target
Name:
B1 bradykinin receptor
Synonyms:
B1 BRADYKININ B1R BK-1 receptor BRADYB1 | Bradykinin B1 receptor
Type:
Enzyme
Mol. Mass.:
40508.87
Organism:
Homo sapiens (Human)
Description:
P46663
Residue:
353
  
Inhibitor
Name:
BDBM50355072
Synonyms:
CHEMBL1835760
Type:
Small organic molecule
Emp. Form.:
C32H32N2O2S
Mol. Mass.:
508.674
SMILES:
O=C(N[C@@H]1CCCc2cc(CN3CCCCC3)ccc12)c1cccc(c1)-c1csc2ccccc2c1=O
: