Target
B1 bradykinin receptor
Ligand
BDBM50355082
Substrate
Meas. Tech.
ChEMBL_772684 (CHEMBL1837152)
Ki
1681±n/a nM
Citation
 Biswas, KPeterkin, TABryan, MCArik, LLehto, SGSun, HHsieh, FYXu, CFremeau, RTAllen, JR Discovery of potent, orally bioavailable phthalazinone bradykinin B1 receptor antagonists. J Med Chem 54:7232-46 (2011)  
Target
Name:
B1 bradykinin receptor
Synonyms:
B1 BRADYKININ B1R BK-1 receptor BRADYB1 | Bradykinin B1 receptor
Type:
Enzyme
Mol. Mass.:
40508.87
Organism:
Homo sapiens (Human)
Description:
P46663
Residue:
353
  
Inhibitor
Name:
BDBM50355082
Synonyms:
CHEMBL1835752
Type:
Small organic molecule
Emp. Form.:
C28H36N2O2
Mol. Mass.:
432.5976
SMILES:
O=C(CCCCC(=O)c1ccccc1)N[C@@H]1CCCc2cc(CN3CCCCC3)ccc12
: