Target
Cyclin-dependent kinase 4
Ligand
BDBM50355500
Substrate
Meas. Tech.
ChEMBL_774260 (CHEMBL1908477)
Kd
>10000±n/a nM
Citation
 Davis, MIHunt, JPHerrgard, SCiceri, PWodicka, LMPallares, GHocker, MTreiber, DKZarrinkar, PP Comprehensive analysis of kinase inhibitor selectivity. Nat Biotechnol 29:1046-51 (2011)  
Target
Name:
Cyclin-dependent kinase 4
Synonyms:
CDK4 Cell division protein kinase 4 PSK-J3
Type:
Enzyme Subunit
Mol. Mass.:
33731.96
Organism:
Homo sapiens (Human)
Description:
P11802
Residue:
303
  
Inhibitor
Name:
BDBM50355500
Synonyms:
CHEMBL1908394 | US9695172, GSK461364
Type:
Small organic molecule
Emp. Form.:
C27H28F3N5O2S
Mol. Mass.:
543.604
SMILES:
C[C@@H](Oc1cc(sc1C(N)=O)-n1cnc2ccc(CN3CCN(C)CC3)cc12)c1ccccc1C(F)(F)F
: