Target
Ephrin type-A receptor 4
Ligand
BDBM50237710
Substrate
Meas. Tech.
ChEMBL_774432 (CHEMBL1908649)
Kd
330±n/a nM
Citation
 Davis, MIHunt, JPHerrgard, SCiceri, PWodicka, LMPallares, GHocker, MTreiber, DKZarrinkar, PP Comprehensive analysis of kinase inhibitor selectivity. Nat Biotechnol 29:1046-51 (2011)  
Target
Name:
Ephrin type-A receptor 4
Synonyms:
EPHA4 Ephrin receptor HEK8 TYRO1
Type:
PROTEIN
Mol. Mass.:
109859.29
Organism:
Homo sapiens (Human)
Description:
ChEMBL_586961
Residue:
986
  
Inhibitor
Name:
BDBM50237710
Synonyms:
4-methyl-N-[3-(4-methyl-1H-imidazol-1-yl)-5-(trifluoromethyl)phenyl]-3-[(4-pyridin-3-ylpyrimidin-2-yl)amino]benzamide AMN107 NILOTINIB | US11649218, Example Nilotinib
Type:
Small organic molecule
Emp. Form.:
C28H22F3N7O
Mol. Mass.:
529.5158
SMILES:
Cc1cn(cn1)-c1cc(NC(=O)c2ccc(C)c(Nc3nccc(n3)-c3cccnc3)c2)cc(c1)C(F)(F)F
: