Target
Prostaglandin D2 receptor 2
Ligand
BDBM50356677
Substrate
Meas. Tech.
ChEMBL_785712 (CHEMBL1920640)
Ki
0.370000±n/a nM
Citation
 Crosignani, SPrêtre, AJorand-Lebrun, CFraboulet, GSeenisamy, JAugustine, JKMissotten, MHumbert, YCleva, CAbla, NDaff, HSchott, OSchneider, MBurgat-Charvillon, FRivron, DHamernig, IArrighi, JFGaudet, MZimmerli, SCJuillard, PJohnson, Z Discovery of potent, selective, and orally bioavailable alkynylphenoxyacetic acid CRTH2 (DP2) receptor antagonists for the treatment of allergic inflammatory diseases. J Med Chem 54:7299-317 (2011)  
Target
Name:
Prostaglandin D2 receptor 2
Synonyms:
CD294 antigen G protein-coupled receptor 44 PD2R2_MOUSE | Ptgdr2
Type:
G Protein-Coupled Receptor (GPCR)
Mol. Mass.:
42975.89
Organism:
Mus musculus (mouse)
Description:
Human embryonic kidney (HEK) 293(EBNA) cells were transfected with mouse CRTH2.
Residue:
382
  
Inhibitor
Name:
BDBM50356677
Synonyms:
CHEMBL1917592
Type:
Small organic molecule
Emp. Form.:
C19H16ClFO5S
Mol. Mass.:
410.844
SMILES:
CCCS(=O)(=O)c1ccc(F)c(c1)C#Cc1cc(Cl)ccc1OCC(O)=O
: