Target
Potassium voltage-gated channel subfamily H member 2
Ligand
BDBM50357207
Substrate
Meas. Tech.
ChEMBL_787991 (CHEMBL1918925)
IC50
4840±n/a nM
Citation
 Lowes, DJGuiguemde, WAConnelly, MCZhu, FSigal, MSClark, JALemoff, ASDerisi, JLWilson, EBGuy, RK Optimization of propafenone analogues as antimalarial leads. J Med Chem 54:7477-85 (2011)  
Target
Name:
Potassium voltage-gated channel subfamily H member 2
Synonyms:
1,3-beta-glucan synthase component GLS2 ERG Eag-related protein 1 Ether-a-go-go-related gene (HERG) Ether-a-go-go-related gene potassium channel 1 Ether-a-go-go-related gene potassium channel 1 (hERG1) Ether-a-go-go-related protein 1 H-ERG KCNH2 Potassium voltage-gated channel subfamily H member 2 (hERG) Voltage-gated potassium channel subunit Kv11.1 hERG Potassium Channel 1 | putative potassium channel subunit
Type:
Multi-pass membrane protein
Mol. Mass.:
126672.65
Organism:
Homo sapiens (Human)
Description:
Q12809
Residue:
1159
  
Inhibitor
Name:
BDBM50357207
Synonyms:
CHEMBL1915364 | CHEMBL1963307
Type:
Small organic molecule
Emp. Form.:
C35H37FN2O3
Mol. Mass.:
552.6783
SMILES:
OC(COc1ccc(F)cc1C(=O)CCc1ccccc1)CN1CCN(CC1)C(c1ccccc1)c1ccccc1
: