Target
Sodium channel protein type 5 subunit alpha
Ligand
BDBM50357204
Substrate
Meas. Tech.
ChEMBL_787992 (CHEMBL1918926)
IC50
>5000±n/a nM
Citation
 Lowes, DJGuiguemde, WAConnelly, MCZhu, FSigal, MSClark, JALemoff, ASDerisi, JLWilson, EBGuy, RK Optimization of propafenone analogues as antimalarial leads. J Med Chem 54:7477-85 (2011)  
Target
Name:
Sodium channel protein type 5 subunit alpha
Synonyms:
HH1 SCN5A_HUMAN Sodium channel protein type 5 subunit alpha/beta-1/beta-2 Voltage-gated sodium channel subunit alpha Nav1.5
Type:
Enzyme
Mol. Mass.:
226908.60
Organism:
Homo sapiens (Human)
Description:
Q14524
Residue:
2016
  
Inhibitor
Name:
BDBM50357204
Synonyms:
CHEMBL1914835 | CHEMBL1963280
Type:
Small organic molecule
Emp. Form.:
C29H33NO3
Mol. Mass.:
443.5772
SMILES:
OC(COc1ccccc1C(=O)CCc1ccccc1)CN1CCC(CC1)c1ccccc1
: