Target
Cytochrome P450 2C19
Ligand
BDBM50357764
Substrate
Meas. Tech.
ChEMBL_784918 (CHEMBL1920310)
IC50
>50000±n/a nM
Citation
 Buzard, DHan, SThoresen, LMoody, JLopez, LKawasaki, ASchrader, TSage, CGao, YEdwards, JBarden, JThatte, JFu, LSolomon, MLiu, LAl-Shamma, HGatlin, JLe, MXing, CEspinola, SJones, RM Discovery and characterization of potent and selective 4-oxo-4-(5-(5-phenyl-1,2,4-oxadiazol-3-yl)indolin-1-yl)butanoic acids as S1P¿? agonists. Bioorg Med Chem Lett 21:6013-8 (2011)  
Target
Name:
Cytochrome P450 2C19
Synonyms:
CP2CJ_HUMAN CYPIIC17 Cytochrome P450 2C19 (CYP2C19) Mephenytoin 4-hydroxylase P450-254C
Type:
Enzyme
Mol. Mass.:
55935.47
Organism:
Homo sapiens (Human)
Description:
P33261
Residue:
490
  
Inhibitor
Name:
BDBM50357764
Synonyms:
CHEMBL1916399
Type:
Small organic molecule
Emp. Form.:
C22H15F3N4O5
Mol. Mass.:
472.3735
SMILES:
OC(=O)CCC(=O)N1CCc2cc(ccc12)-c1noc(n1)-c1cc(OC(F)(F)F)cc(c1)C#N
: