Target
5-hydroxytryptamine receptor 6
Ligand
BDBM50357992
Substrate
Meas. Tech.
ChEMBL_786347 (CHEMBL1920543)
Ki
14460±n/a nM
Citation
 Zajdel, PMarciniec, KMaslankiewicz, APaluchowska, MHSatala, GPartyka, AJastrzebska-Wiesek, MWróbel, DWesolowska, ADuszynska, BBojarski, AJPawlowski, M Arene- and quinoline-sulfonamides as novel 5-HT7 receptor ligands. Bioorg Med Chem 19:6750-9 (2011)  
Target
Name:
5-hydroxytryptamine receptor 6
Synonyms:
5-HT-6 5-hydroxytryptamine receptor 6 (5-HT-6) 5-hydroxytryptamine receptor 6 (5HT6) HTR6 Serotonin 6 (5-HT6) receptor | Serotonin Receptor 6
Type:
G Protein-Coupled Receptor (GPCR)
Mol. Mass.:
46968.43
Organism:
Homo sapiens (Human)
Description:
P50406
Residue:
440
  
Inhibitor
Name:
BDBM50357992
Synonyms:
CHEMBL1917358
Type:
Small organic molecule
Emp. Form.:
C24H35N3O2S
Mol. Mass.:
429.619
SMILES:
CCN(CCCCN1CCC2CCCCC2C1)S(=O)(=O)c1cnc2ccccc2c1
: