Target
Mu-type opioid receptor
Ligand
BDBM50219916
Substrate
Meas. Tech.
ChEMBL_788808 (CHEMBL1924793)
Ki
2.4±n/a nM
Citation
 Mitch, CHQuimby, SJDiaz, NPedregal, Cde la Torre, MGJimenez, AShi, QCanada, EJKahl, SDStatnick, MAMcKinzie, DLBenesh, DRRash, KSBarth, VN Discovery of aminobenzyloxyarylamides as¿ opioid receptor selective antagonists: application to preclinical development of a¿ opioid receptor antagonist receptor occupancy tracer. J Med Chem 54:8000-12 (2011)  
Target
Name:
Mu-type opioid receptor
Synonyms:
M-OR-1 MOR-1 MUOR1 Mu opiate receptor OPRM1 hMOP | mu-type opioid receptor isoform MOR-1
Type:
G Protein-Coupled Receptor (GPCR)
Mol. Mass.:
44789.51
Organism:
Homo sapiens (Human)
Description:
P35372
Residue:
400
  
Inhibitor
Name:
BDBM50219916
Synonyms:
6-(4-((benzylamino)methyl)phenoxy)nicotinamide | CHEMBL238316
Type:
Small organic molecule
Emp. Form.:
C20H19N3O2
Mol. Mass.:
333.3838
SMILES:
NC(=O)c1ccc(Oc2ccc(CNCc3ccccc3)cc2)nc1
: