Target
Galanin receptor type 1
Ligand
BDBM50358661
Substrate
Meas. Tech.
ChEMBL_789438 (CHEMBL1924414)
IC50
6320±n/a nM
Citation
 Sagi, VNLiu, TLu, XBartfai, TRoberts, E Synthesis and biological evaluation of novel pyrimidine derivatives as sub-micromolar affinity ligands of GalR2. Bioorg Med Chem Lett 21:7210-5 (2011)  
Target
Name:
Galanin receptor type 1
Synonyms:
GAL1-R GALNR1 GALR1_HUMAN Galanin receptor 1 | Galanin receptor type 1
Type:
Enzyme Catalytic Domain
Mol. Mass.:
38976.60
Organism:
Homo sapiens (Human)
Description:
Galanin R1 GALR1 HUMAN::P47211
Residue:
349
  
Inhibitor
Name:
BDBM50358661
Synonyms:
CHEMBL1922002
Type:
Small organic molecule
Emp. Form.:
C27H31F4N7O
Mol. Mass.:
545.575
SMILES:
COc1ccc(Nc2cc(nc(n2)N2CCCN(CC2)c2ncccc2C(F)(F)F)N2CCCCC2)cc1F
: