Target
C-C chemokine receptor type 5
Ligand
BDBM50359480
Substrate
Meas. Tech.
ChEMBL_792600 (CHEMBL1930241)
IC50
0.6±n/a nM
Citation
 Skerlj, RBridger, GZhou, YBourque, EMcEachern, ELangille, JHarwig, CVeale, DYang, WLi, TZhu, YBey, MBaird, ISartori, MMetz, MMosi, RNelson, KBodart, VWong, RFricker, SMac Farland, RHuskens, DSchols, D Design and synthesis of pyridin-2-ylmethylaminopiperidin-1-ylbutyl amide CCR5 antagonists that are potent inhibitors of M-tropic (R5) HIV-1 replication. Bioorg Med Chem Lett 21:6950-4 (2011)  
Target
Name:
C-C chemokine receptor type 5
Synonyms:
C-C CKR-5 CC-CKR-5 CCR5 CCR5_HUMAN CHEMR13 HIV-1 fusion coreceptor
Type:
Enzyme
Mol. Mass.:
40540.21
Organism:
Homo sapiens (Human)
Description:
P51681
Residue:
352
  
Inhibitor
Name:
BDBM50359480
Synonyms:
CHEMBL1926900
Type:
Small organic molecule
Emp. Form.:
C33H44ClN5O3
Mol. Mass.:
594.187
SMILES:
COCCOc1ccc(cc1)N(Cc1cnccc1C)C1CCN(CC1)[C@H](C)CCNC(=O)c1c(C)cc(Cl)nc1C
: