Target
D(3) dopamine receptor
Ligand
BDBM50359764
Substrate
Meas. Tech.
ChEMBL_791615 (CHEMBL1930839)
Ki
330±n/a nM
Citation
 Huber, DLöber, SHübner, HGmeiner, P Bivalent molecular probes for dopamine D2-like receptors. Bioorg Med Chem 20:455-66 (2011)  
Target
Name:
D(3) dopamine receptor
Synonyms:
DOPAMINE D3 DRD3_HUMAN Dopamine D3 receptor (D3) Dopamine receptor Dopamine receptor D3
Type:
Mol. Mass.:
44243.43
Organism:
Homo sapiens (Human)
Description:
Residue:
400
  
Inhibitor
Name:
BDBM50359764
Synonyms:
CHEMBL1928123
Type:
Small organic molecule
Emp. Form.:
C26H37N3O4
Mol. Mass.:
455.5897
SMILES:
CCOCCOCc1ccc(cc1)C(=O)NCCCN1CCN(CC1)c1ccccc1OC
: