Target
Alpha-1A adrenergic receptor
Ligand
BDBM50359762
Substrate
Meas. Tech.
ChEMBL_791620 (CHEMBL1930844)
Ki
1.4±n/a nM
Citation
 Huber, DLöber, SHübner, HGmeiner, P Bivalent molecular probes for dopamine D2-like receptors. Bioorg Med Chem 20:455-66 (2011)  
Target
Name:
Alpha-1A adrenergic receptor
Synonyms:
Uncharacterized protein
Type:
PROTEIN
Mol. Mass.:
51698.80
Organism:
Sus scrofa
Description:
ChEMBL_791620
Residue:
466
  
Inhibitor
Name:
BDBM50359762
Synonyms:
CHEMBL1928121
Type:
Small organic molecule
Emp. Form.:
C50H68N6O9
Mol. Mass.:
897.1097
SMILES:
COc1ccccc1N1CCN(CCCNC(=O)c2cccc(OCCOCCOCCOCCOc3cccc(c3)C(=O)NCCCN3CCN(CC3)c3ccccc3OC)c2)CC1
: