Target
Cholecystokinin receptor type A
Ligand
BDBM50360276
Substrate
Meas. Tech.
ChEMBL_796415 (CHEMBL1937730)
Ki
2.3±n/a nM
Citation
 Pavan, MVLassiani, LBerti, FStefancich, GCiogli, AGasparrini, FMennuni, LFerrari, FEscrieut, CMarco, EMakovec, FFourmy, DVarnavas, A New anthranilic acid based antagonists with high affinity and selectivity for the human cholecystokinin receptor 1 (hCCK1-R). J Med Chem 54:5769-85 (2011)  
Target
Name:
Cholecystokinin receptor type A
Synonyms:
CCK-A receptor CCK1-R CCKAR_HUMAN Cholecystokinin receptor Cholecystokinin-1 Receptor
Type:
G Protein-Coupled Receptor (GPCR)
Mol. Mass.:
47859.34
Organism:
Homo sapiens (Human)
Description:
Stable expression of human CCK-1 receptors in HEK 293 cells.
Residue:
428
  
Inhibitor
Name:
BDBM50360276
Synonyms:
CHEMBL1933104
Type:
Small organic molecule
Emp. Form.:
C26H23N3O4
Mol. Mass.:
441.4785
SMILES:
OC(=O)[C@@H](CCc1ccccc1)NC(=O)c1ccccc1NC(=O)c1cc2ccccc2[nH]1
: