Target
Prostaglandin E2 receptor EP1 subtype
Ligand
BDBM50156547
Substrate
Meas. Tech.
ChEMBL_795666 (CHEMBL1936147)
Ki
>10000±n/a nM
Citation
 Kambe, TMaruyama, TNakano, MNakai, YYoshida, TMatsunaga, NOida, HKonaka, AMaruyama, TNakai, HToda, M Discovery of a novel EP2/EP4 dual agonist with high subtype-selectivity. Bioorg Med Chem Lett 22:396-401 (2011)  
Target
Name:
Prostaglandin E2 receptor EP1 subtype
Synonyms:
PE2R1_MOUSE Prostaglandin E1 Prostanoid EP1 receptor Ptgerep1
Type:
G-protein coupled receptor
Mol. Mass.:
43000.62
Organism:
Mus musculus (Mouse)
Description:
Residue:
405
  
Inhibitor
Name:
BDBM50156547
Synonyms:
4-(2-((R)-2-((S)-3-hydroxyoct-1-enyl)-5-oxopyrrolidin-1-yl)ethyl)benzoate CHEMBL222715
Type:
Small organic molecule
Emp. Form.:
C21H29NO4
Mol. Mass.:
359.4593
SMILES:
CCCCC[C@H](O)\C=C\[C@H]1CCC(=O)N1CCc1ccc(cc1)C(O)=O
: