Target
D(2) dopamine receptor
Ligand
BDBM50360708
Substrate
Meas. Tech.
ChEMBL_795936 (CHEMBL1936809)
IC50
500±n/a nM
Citation
 Chen, XMihalic, JFan, PLiang, LLindstrom, MWong, SYe, QFu, YJaen, JChen, JLDai, KLi, L Discovery and characterization of a potent and selective antagonist of melanin-concentrating hormone receptor 2. Bioorg Med Chem Lett 22:363-6 (2011)  
Target
Name:
D(2) dopamine receptor
Synonyms:
D(2) dopamine receptor DOPAMINE D2 Long DRD2 Dopamine D2 receptor Dopamine D2 receptor (D2R) Dopamine2-like | d2
Type:
Cell-surface receptors
Mol. Mass.:
50647.10
Organism:
Homo sapiens (Human)
Description:
P14416
Residue:
443
  
Inhibitor
Name:
BDBM50360708
Synonyms:
CHEMBL1934127
Type:
Small organic molecule
Emp. Form.:
C28H28ClN3O
Mol. Mass.:
457.994
SMILES:
CC(=O)N[C@@H]1CC2(CCN(Cc3ccc4[nH]c5ccc(Cl)cc5c4c3)CC2)c2ccccc12
: